{"text_format":"1","workbook":"xlsx","n_sheets":9,"sheets":["Events","eVars","Props","Issues","Opportunities","s_code","page_code_sample","QA_Charles_Scrapping","AnF"],"not_rendered":{"charts":0,"images":2,"macros":1,"external_links":0,"defined_names":7,"comments":0,"pivot_tables":0},"unopened":[],"bounds":{"document_bytes":16777216,"sheet_cells":100000,"rows_first":2000,"rows_last":500,"rows_between":2000,"halvings":0,"cell_chars":16384,"cell_head_chars":4096},"cells_cut":0,"cells_raw":0,"read":"whole","date_system":"1900"}

{"sheet":"Events","index":0,"n_rows":90,"n_cols":10,"rows_kept":90,"cut":false,"hidden":false,"merged":[[0,0,0,8]]}
["Abercrombie & Fitch Events"]
["Variable","Name","Where Found","Description","Source","Call Type","Set","Notes","Event Type","*New or Updated variables"]
["prodView","Product Views",null,null,"page code","pageview","pdp","s.events=\"prodView\"","Counter","*s_code indicates something in Products string, but I did not complete a transaction so what exactly this represents is unknown."]
["scOpen","Cart Opens",null,"Event to identify when a new Cart is started","page code","pageview",null,"s.events=\"scOpen\"; Only set on first item added to a cart","Counter"]
["scAdd","Cart Adds","from Product Detail page; Top Nav Wish List dropdown; ","Event to identify an item added to tshopping cart","page code","pageview",null,"s.events=\"scAdd\"","Counter"]
["scView","Cart Views",null,"Views of the Shopping Cart","page code","pageview","cart page","s.events=\"scView\"","Counter"]
["scCheckout","Checkouts",null,null,"page code","pageview","checkout","s.events=\"scCheckout\"","Counter"]
["s.products=;prodId;units;revenue","Revenue",null,null,"page code","pageview","checkout","s.products=\";prodId;units;revenue\"","Currency"]
["s.products=;prodId;units;revenue","Units",null,null,"page code","pageview","checkout","s.products=\";prodId;units;revenue\"","Numeric"]
["purchase","Orders",null,null,"page code","pageview","checkout","s.events=\"purchase\"","Counter"]
["event1","Internal Search","search term: shirt",null,"page code","pageview","internal search",null,"Counter"]
["event2","Internal Null Search","search term: keystone","provide count of searches which had zero results","page code","pageview","internal search",null,"Counter"]
["event3","Email Opt Outs",null,"Removed in favor of eVar",null,null,null,null,"Counter"]
["event4","Email Unsubscribes ","Profile - email settings",null,"page code","link","profile",null,"Counter"]
["event5","Account Creations","Registration process",null,"page code","pageview","registration","This should fire on all Registrations, regardless of area.","Counter"]
{"$rows_left_out":76}
{"sheet":"eVars","index":1,"n_rows":82,"n_cols":12,"rows_kept":82,"cut":false,"hidden":false,"merged":[[0,0,0,10]]}
["Abercrombie & Fitch Event Variables"]
["Variable","CC","Name","Type","Description","Source","Call Type","Set","Conditions","Setting Examples","Note","*New or Updated variables"]
["products",null,"Products","Text String",null,"page code","pageview","PDP, cart, checkout",null,null,null,"*s_code indicates something in Products string, but I did not complete a transaction so what exactly this represents is unknown."]
["purchaseID",null,"Purchase ID","Text String","ID of an order","page code","pageview","checkout"]
["state",null,"State ","Text String",null,"page code","pageview","set globally"]
["zip",null,"Zip","Text String",null,"page code","pageview","set globally"]
["campaign",null,"Tracking Code","Text String",null,"s_code","pageview","set globally",null,null,"Prefaces "]
["eVar1","prop4","Site","Text String","included in pagenames","page code","pageview, links","set globally",null,null,"Different # for Abercrombie, Hollister, Gilly's"]
["eVar2","prop5","Country","Text String","identify country of activity","page code","pageview, links","set globally"]
["eVar3",null,"User Status","Text String","Logged In/Out status","page code","pageview, links","set globally",null,"Anonymous,\nRemembered"]
["eVar4",null,"Currency Code","Text String",null,"page code","pageview, link","set globally"]
["eVar5",null,"Merchandising Category","Text String","Track when visitor is in Product Catalog","page code","pageviews","page specific",null,"Browse,\nNon-Browse"]
["eVar6"]
["eVar7",null,"A/B Test1","Text String",null,"s_code","pageviews","page specific",null,null,"s.eVar7 = $.cookie('langABTest');"]
["eVar8"]
{"$rows_left_out":68}
{"sheet":"Props","index":2,"n_rows":57,"n_cols":14,"rows_kept":57,"cut":false,"hidden":false,"merged":[[0,0,0,12]]}
["Abercrombie & Fitch Traffic Variables"]
["Variable","CC","Name","Description","Source","Type of Call","Set","Conditions","Setting Examples","Pathing","Notes",null,null,"*New or Updated variables"]
["pageName",null,"Pages","Allows tracking of page views/visits, as well as page pathing.","page code","pageview","all pages",null,null,"Yes",null,null,null,"*s_code indicates something in Products string, but I did not complete a transaction so what exactly this represents is unknown."]
["channel",null,"Site Sections","Track traffic to sections of site, as well as pathing between sections.","page code","pageview, links","all pages",null,null,"Yes",null,null,"=s.prop1"]
["server",null,"Server",null,"s_code","pageview","set globally",null,null,null,null,"no data"]
["pageType",null,"Pages Not Found","decide type of page, with pathing","page code","pageview","all pages",null,null,null,null,"no data"]
["prop1",null,"Category","section of site","page code","pageview, links","all pages",null,null,"Yes",null,"an:us:womens"]
["prop2",null,"Sub Category","sub-section of prop1","page code","pageview, links","all pages",null,null,"Yes",null,"an:us:womens","See Issues #17"]
["prop3",null,"Page Type",null,"page code","pageview","page specific"]
["prop4","eVar1","Site","used to decide report suite, included in pagenames","page code","pageview, links","set globally"]
["prop5","eVar2","Country","identify country of activity","page code","pageview, links","set globally"]
["prop6",null,"Category ID","Identify what section of Product Catalog","page code","pageview","page specific",null,null,null,null,"numeric id","See Issues #18"]
["prop7",null,"Parent Category ID","Identify what section of Product Catalog","page code","pageview","page specific",null,null,null,null,"numeric id","See Issues #18"]
["prop8"]
["prop9"]
{"$rows_left_out":43}
{"sheet":"Issues","index":3,"n_rows":99,"n_cols":2,"rows_kept":99,"cut":false,"hidden":true,"merged":[[1,0,1,1]]}
[]
["Issues"]
[1,"On 'Save' click for Registration Step 2, 4 separate tags fired. The first had Event47, the second Event46, the third had all the same props and eVars as the first two but without any Events; the fourth had the same as the third except for prop9 was populated instead of prop35."]
[{"$f":"IF(B4<>\"\",A3+1,\"\")","v":2},"Tried to Register again. Got to Step 2, selection at least one option from each section, but the 'Save' button wouldn't activate. Eventually clicked the 'continue shopping' link, and after page_load the header indicated I was still logged in. Signed out then back in and the options I had checked on Step 2 were not selected in my profile. Finally got registratration Step 2 to save as long as I didn't check the 'Text' box."]
[3,"Went to the Change Address page in the Profile section. Updated address, but when I clicked SAVE two page tags fired, with all the same info except for the Previous Page prop, where the second tag listed the Address page."]
[4,"An Event fires when you opt-in for email on the My Info-Email&Phone page in the Profile section. What is weird is the Sign-up Event also fires if you change the frequency of an email from Weekly to Monthly. Fires even if you choose the same frequency option."]
[5,"An Event fires when you opt-in for SMS, even if you opt-in to an option you are already signed up for. Also, the Unsub Event will trigger if you click the Unsub option even if you were never opted in to begin with."]
[6,"Event37 fires on a click of a color swatch on the Quick View overlay, and the Products string is populated with the item#. A click on the square of color fires a single tag correctly. But when you click on the arrow of the color dropdown list it also fires the Event, with an empty Products string. When you select a color from the dropdown two tags fire, on with the correct Event# and Products string, but the second has the Event# with an empty Products string. The Event should NOT fire on the dropdown arrow, and only one tag should fire for the list selection. Odd that the clicks of Color Swatches on the regular Product View page are not recorded. This issue does not occur on the Product Details page Magnify overlay."]
[7,"When you select the 'No emails/Unsubscribe' option from the dropdown menu on the Profile - Email & Phone page, then hit the Submit button Event4 (Email Unsubscribes) fires. The issues are twofold: 1) You don't event need to be subscribed to have the event fire. 2) It fires once, regardless if you Unsub from one brand's email for from multiple brands. 3) No record is made of which brand email you are unsubsribing from, even though there are seperate Events for each Brand signup."]
[{"$f":"IF(B10<>\"\",A9+1,\"\")","v":8},"Event5 fired on Registration click even though there was an error with a field requirement. Only recorded this Event during the first try, once I logged out subsequent registrations during the same Vist didn't record this Event. Tried again later, but found this to be inconsistent."]
[{"$f":"IF(B11<>\"\",A10+1,\"\")","v":9},"On the A&F Looks pages within the Products sections there is sometimes the option for 'Product View' and 'Modal View'. For some labeled 'Product View' prop15 is capturing 'Modal View'."]
[10,"On the A&F Looks pages within the Products sections there is Twitter button. Pressing this fires an exit link, but not the Event50 Share Twitter event, but it does populate prop15 and eVar73 with 'Modal View'."]
[11,"Removing an item from the Wish list via the Top Nav Wish List dropdown fires a link_o with prop15 set to 'remove wishlist', this also fires when the Add to Bag link on this dropdown is clicked (as the item is removed/transferred to the shopping cart). But if you click the 'remove' link on the Wish List Details page no tag is fired for prop15."]
[12,"When the 'Send' button is clicked on the Wish List Details page to Share the item via email Event51 fires even if there is an error with the form fields which prevents the email from sending."]
[13,"The Share Facebook Event49 fires on button click, not on successful share. Ideally you would want this to fire on the success event, not the intent event."]
{"$rows_left_out":85}
{"sheet":"Opportunities","index":4,"n_rows":3,"n_cols":2,"rows_kept":3,"cut":false,"hidden":true,"merged":[]}
[]
[null,"Did not capture 'Share Location' on Find a Store page"]
[null,"Not capturing Shares on Experience A&F Video"]

{"sheet":"s_code","index":5,"n_rows":541,"n_cols":1,"rows_kept":541,"cut":false,"hidden":true,"merged":[]}
["                                /* SiteCatalyst code version: H.22.1."]
["Copyright 1996-2011 Adobe, Inc. All Rights Reserved"]
["More info available at http://www.omniture.com */"]
["/************************ ADDITIONAL FEATURES ************************"]
["     Plugins"]
["*/"]
[]
["var s_account=\"afabercrombieprod\";"]
[]
["var s_domain=window.location.host;"]
["if(s_domain.indexOf('m.abercrombie.com')>-1)"]
["        s_account=\"afabercrombiemobileprod\";"]
["        "]
["var s=s_gi(s_account)"]
["/************************** CONFIG SECTION **************************/"]
{"$rows_left_out":527}
{"sheet":"page_code_sample","index":6,"n_rows":63,"n_cols":1,"rows_kept":63,"cut":false,"hidden":true,"merged":[]}
["s.eVar3=\"Anonymous\";"]
["        "]
[]
[]
["        var previousPage = document.referrer;"]
["        if(previousPage.length>1){"]
["                s.eVar64 = previousPage.toLowerCase();"]
["        }"]
["        var storeId=queryObject.getQueryValue('storeId');"]
["        var topCategoryId=queryObject.getQueryValue('topCategoryId');"]
["        var parentCategoryId=queryObject.getQueryValue('parentCategoryId');"]
["        var categoryId=queryObject.getQueryValue('categoryId');"]
["        var campaignId=queryObject.getQueryValue('utm_campaign');"]
["        var ID = $.cookie('JSESSIONID');"]
["                if((storeId=='11203') || (storeId=='11204') || (storeId=='11205') || (storeId=='14621')){"]
{"$rows_left_out":49}
{"sheet":"QA_Charles_Scrapping","index":7,"n_rows":280,"n_cols":17,"rows_kept":280,"cut":false,"hidden":false,"merged":[[0,6,0,8],[2,1,2,3]]}
[null,null,"Enter Website Specs Tab Name:","AnF",1,null,"Variables for PowerPoint"]
[{"$f":"IF(A5<>\"\",A3&\",\"&A4&\",\"&A5,IF(A4<>\"\",A3&\",\"&A4,A3))","v":""},{"$f":"INDEX(C4:C100,MATCH(\"events\",B4:B100,0))","v":{"$error":"#N/A"}},null,null,1,null,"Charles Parameter","Parameter \nFriendly Name","Charles Value (The formula in this column will replace two levels of \"D=\" instances with the proper value)"]
[{"$f":"IFERROR(IF(LEN(B2)-LEN(SUBSTITUTE(B2,\",\",\"\"))=0,VLOOKUP(B2,INDIRECT($D$1&\"!A:B\"),2,FALSE),VLOOKUP(LEFT(B2,LEN(B2)-(LEN(B2) - FIND(\",\",B2))-1),INDIRECT($D$1&\"!A:B\"),2,FALSE)),\"\")","v":""},"Paste Charles Data Here",null,null,1,null,"t","Time/Date",{"$f":"IFERROR(IF(LEFT(VLOOKUP(G3,$B:$C,2,FALSE),2)=\"D=\",IF(LEFT(VLOOKUP(RIGHT(VLOOKUP(G3,$B:$C,2,FALSE),LEN(VLOOKUP(G3,$B:$C,2,FALSE))-2),$B:$C,2,FALSE),2)=\"D=\",VLOOKUP(RIGHT(LEFT(VLOOKUP(RIGHT(VLOOKUP(G3,$B:$C,2,FALSE),LEN(VLOOKUP(G3,$B:$C,2,FALSE))-2),$B:$C,1,FALSE),2),2),$B:$C,2,FALSE),VLOOKUP(RIGHT(VLOOKUP(G3,$B:$C,2,FALSE),LEN(VLOOKUP(G3,$B:$C,2,FALSE))-2),$B:$C,2,FALSE)),VLOOKUP(G3,$B:$C,2,FALSE)),\"\")","v":41038.791446759256},{"$f":"IF(M3=#REF!,\"Y\",\"N\")","v":{"$error":"#REF!"}},"pageName","Pages","/store/plans/lnp/port eligibility",null,{"$f":"IFERROR(INDEX(INDIRECT($D$1&\"!A:A\"),MATCH(P3,INDIRECT($D$1&\"!B:B\"),0),1),\"\")","v":"ns"},"Report Suite",{"$f":"IFERROR(IF(LEFT(VLOOKUP(O3,$B:$C,2,FALSE),2)=\"D=\",IF(LEFT(VLOOKUP(RIGHT(VLOOKUP(O3,$B:$C,2,FALSE),LEN(VLOOKUP(O3,$B:$C,2,FALSE))-2),$B:$C,2,FALSE),2)=\"D=\",VLOOKUP(RIGHT(LEFT(VLOOKUP(RIGHT(VLOOKUP(O3,$B:$C,2,FALSE),LEN(VLOOKUP(O3,$B:$C,2,FALSE))-2),$B:$C,1,FALSE),2),2),$B:$C,2,FALSE),VLOOKUP(RIGHT(VLOOKUP(O3,$B:$C,2,FALSE),LEN(VLOOKUP(O3,$B:$C,2,FALSE))-2),$B:$C,2,FALSE)),VLOOKUP(O3,$B:$C,2,FALSE)),\"\")","v":"abercrombie"}]
[{"$f":"IFERROR(IF(LEN(B2)-LEN(SUBSTITUTE(B2,\",\",\"\"))=1,VLOOKUP(RIGHT(B2,LEN(B2)-FIND(\",\",B2)),INDIRECT($D$1&\"!A:B\"),2,FALSE),IF(LEN(B2)-LEN(SUBSTITUTE(B2,\",\",\"\"))=2,VLOOKUP(MID(B2,FIND(\",\",B2)+1,FIND(\",\",B2,FIND(\",\",B2)+1)-FIND(\",\",B2)-1),INDIRECT($D$1&\"!A:B\"),2,FALSE),\"\")),\"\")","v":""},"AQB",1,null,1,null,"ns","Report Suite","abercrombie",{"$f":"IF(M4=#REF!,\"Y\",\"N\")","v":{"$error":"#REF!"}},"g","Not Listed","http://www.verizonwireless.com/b2c/LNPControllerServlet",null,{"$f":"IFERROR(INDEX(INDIRECT($D$1&\"!A:A\"),MATCH(P4,INDIRECT($D$1&\"!B:B\"),0),1),\"\")","v":"v46"},"Page Name","anf:us:homepage"]
[{"$f":"IFERROR(IF(LEN(B2)-LEN(SUBSTITUTE(B2,\",\",\"\"))=2,VLOOKUP(RIGHT(B2,LEN(B2)-FIND(\",\",B2,FIND(\",\",B2)+1)),INDIRECT($D$1&\"!A:B\"),2,FALSE),\"\"),\"\")","v":""},"ndh",1,null,1,null,"pageName","Page Name","anf:us:homepage",{"$f":"IF(M5=#REF!,\"Y\",\"N\")","v":{"$error":"#REF!"}},"r","Not Listed","http://www.verizonwireless.com/b2c/LNPControllerServlet",null,"","Site Section Level 1",""]
[null,"t",41038.791446759256,null,1,null,"g","Current Url","http://www.abercrombie.com/webapp/wcs/stores/servlet/StoreView?storeId=10051&langId=-1&catalogId=10901",{"$f":"IF(M6=#REF!,\"Y\",\"N\")","v":{"$error":"#REF!"}},"ch","Site Section Level 1","/store",null,"server","Server",""]
[null,"ns","abercrombie",null,1,null,"cc","Currency Code","USD",{"$f":"IF(M7=#REF!,\"Y\",\"N\")","v":{"$error":"#REF!"}},"server","server","www.verizonwireless.com",null,"events","Events",""]
[null,"pageName","anf:us:homepage",null,1,null,"ch","Site Sections","anf:us:homepage",{"$f":"IF(M8=#REF!,\"Y\",\"N\")","v":{"$error":"#REF!"}},"events","events","event7"]
[null,"g","http://www.abercrombie.com/webapp/wcs/stores/servlet/StoreView?storeId=10051&langId=-1&catalogId=10901",null,1,null,"v1","Site",{"$f":"IFERROR(IF(LEFT(VLOOKUP(G9,$B:$C,2,FALSE),2)=\"D=\",IF(LEFT(VLOOKUP(RIGHT(VLOOKUP(G9,$B:$C,2,FALSE),LEN(VLOOKUP(G9,$B:$C,2,FALSE))-2),$B:$C,2,FALSE),2)=\"D=\",VLOOKUP(RIGHT(LEFT(VLOOKUP(RIGHT(VLOOKUP(G9,$B:$C,2,FALSE),LEN(VLOOKUP(G9,$B:$C,2,FALSE))-2),$B:$C,1,FALSE),2),2),$B:$C,2,FALSE),VLOOKUP(RIGHT(VLOOKUP(G9,$B:$C,2,FALSE),LEN(VLOOKUP(G9,$B:$C,2,FALSE))-2),$B:$C,2,FALSE)),VLOOKUP(G9,$B:$C,2,FALSE)),\"\")","v":10051},{"$f":"IF(M9=#REF!,\"Y\",\"N\")","v":{"$error":"#REF!"}},"c1","Site Section Level 2","/plans"]
[null,"cc","USD",null,1,null,"v2","Country",{"$f":"IFERROR(IF(LEFT(VLOOKUP(G10,$B:$C,2,FALSE),2)=\"D=\",IF(LEFT(VLOOKUP(RIGHT(VLOOKUP(G10,$B:$C,2,FALSE),LEN(VLOOKUP(G10,$B:$C,2,FALSE))-2),$B:$C,2,FALSE),2)=\"D=\",VLOOKUP(RIGHT(LEFT(VLOOKUP(RIGHT(VLOOKUP(G10,$B:$C,2,FALSE),LEN(VLOOKUP(G10,$B:$C,2,FALSE))-2),$B:$C,1,FALSE),2),2),$B:$C,2,FALSE),VLOOKUP(RIGHT(VLOOKUP(G10,$B:$C,2,FALSE),LEN(VLOOKUP(G10,$B:$C,2,FALSE))-2),$B:$C,2,FALSE)),VLOOKUP(G10,$B:$C,2,FALSE)),\"\")","v":"us"},{"$f":"IF(M10=#REF!,\"Y\",\"N\")","v":{"$error":"#REF!"}},"v1","Time Parting","6:30PM"]
[null,"ch","anf:us:homepage",null,1,null,"c3","Page Type","anf:US:HomePage",{"$f":"IF(M11=#REF!,\"Y\",\"N\")","v":{"$error":"#REF!"}},"c2","Site Section Level 3","/lnp"]
[null,"v1",10051,null,1,null,"v3","User Status","Anonymous",{"$f":"IF(M12=#REF!,\"Y\",\"N\")","v":{"$error":"#REF!"}},"v5","New/Repeat Visitor","Repeat"]
[null,"v2","us",null,1,null,"c4","Site","anf",{"$f":"IF(M13=#REF!,\"Y\",\"N\")","v":{"$error":"#REF!"}},"c8","Previous Page","/store/plans/lnp"]
[null,"c3","anf:US:HomePage",null,1,null,"c5","Country","us",{"$f":"IF(M14=#REF!,\"Y\",\"N\")","v":{"$error":"#REF!"}},"v8","Flow Name","D=c1"]
[null,"v3","Anonymous",null,1,null,"v11","Visitor ID","000069wBx2Qd6ZnlsijU_KkDJEN:15r7tjg9d",{"$f":"IF(M15=#REF!,\"Y\",\"N\")","v":{"$error":"#REF!"}},"c9","% of Page Viewed","60|60"]
{"$rows_left_out":266}
{"sheet":"AnF","index":8,"n_rows":335,"n_cols":22,"rows_kept":335,"cut":false,"hidden":false,"merged":[]}
[null,null,null,"Don't Adjust hidden columns",{"$f":"IF(F1<>\"\",RANK(F1,F:F,1),\"\")","v":""},{"$f":"IF(B1<>\"\",ROW(F1),\"\")","v":""},{"$f":"IF(F1<>\"\",A1,\"\")","v":""},{"$f":"IF(B1<>\"\",B1,\"\")","v":""},1,{"$f":"IFERROR(VLOOKUP(I1,E:H,4,FALSE),\"\")","v":""}]
[null,null,null,null,{"$f":"IF(F2<>\"\",RANK(F2,F:F,1),\"\")","v":""},{"$f":"IF(B2<>\"\",ROW(F2),\"\")","v":""},{"$f":"IF(F2<>\"\",A2,\"\")","v":""},{"$f":"IF(B2<>\"\",B2,\"\")","v":""},2,{"$f":"IFERROR(VLOOKUP(I2,E:H,4,FALSE),0)","v":0}]
[null,null,null,null,"","","","",3,{"$f":"IFERROR(VLOOKUP(I3,E:H,4,FALSE),0)","v":0}]
["Place Site Specific SDR data in column \"B\" below",null,null,null,"","","","",4,0]
["Events #","****Events****",null,null,{"$error":"#REF!"},5,"Events #","****Events****",5,0,"Rank","Rank A",null,"Events","Rank","Rank A",null,"eVars","Rank","Rank A",null,"s.Props (traffic)"]
["event1","Internal Search",null,null,{"$error":"#REF!"},6,"event1","Internal Search",6,0,{"$f":"COUNTIF($B$6:$B$105, \"<=\"&$B6)","v":60},1,{"$f":"IFERROR(INDEX($A$6:$A$105,MATCH(L6,$K$6:$K$105,0)),\"\")","v":""},{"$f":"IFERROR(INDEX($B$6:$B$105,MATCH(L6,$K$6:$K$105,0)),\"\")","v":""},{"$f":"COUNTIF($B$108:$B$207, \"<=\"&$B108)","v":67},1,{"$f":"IFERROR(INDEX($A$108:$A$207,MATCH(P6,$O$6:$O$105,0)),\"\")","v":""},{"$f":"IFERROR(INDEX($B$108:$B$207,MATCH(P6,$O$6:$O$105,0)),\"\")","v":""},{"$f":"COUNTIF($B$211:$B$310, \"<=\"&$B211)","v":49},1,{"$f":"IFERROR(INDEX($A$210:$A$310,MATCH(T6,$S$6:$S$105,0)),\"\")","v":""},{"$f":"IFERROR(INDEX($B$211:$B$310,MATCH(T6,$S$6:$S$105,0)),\"\")","v":""}]
["event2","Internal Null Search",null,null,{"$error":"#REF!"},7,"event2","Internal Null Search",7,0,{"$f":"COUNTIF($B$6:$B$105, \"<=\"&$B7)","v":59},2,"",{"$f":"IFERROR(INDEX($B$6:$B$105,MATCH(L7,$K$6:$K$105,0)),\"\")","v":""},{"$f":"COUNTIF($B$108:$B$207, \"<=\"&$B109)","v":35},2,"","",{"$f":"COUNTIF($B$211:$B$310, \"<=\"&$B212)","v":72},2,"",""]
["event3","Email Opt Outs",null,{"$f":"OFFSET(INDIRECT(QA_Charles_Scrapping!$D$1&\"!a6\"),,,MATCH(\"\",INDIRECT(QA_Charles_Scrapping!$D$1&\"!a5:a105\"),0)-2,2)","v":{"$error":"#N/A"}},{"$error":"#REF!"},8,"event3","Email Opt Outs",8,0,50,3,"","",70,3,"","",{"$f":"COUNTIF($B$211:$B$310, \"<=\"&$B213)","v":59},3,"",""]
["event4","Email Unsubscribes ",null,{"$f":"MATCH(\"\",INDIRECT(QA_Charles_Scrapping!$D$1&\"!a5:a105\"),0)-2","v":{"$error":"#N/A"}},{"$error":"#REF!"},9,"event4","Email Unsubscribes ",9,0,57,4,"","",36,4,"","",{"$f":"COUNTIF($B$211:$B$310, \"<=\"&$B214)","v":71},4,"",""]
["event5","Account Creations",null,null,{"$error":"#REF!"},10,"event5","Account Creations",10,0,45,5,"","",45,5,"","",{"$f":"COUNTIF($B$211:$B$310, \"<=\"&#REF!)","v":0},5,"",""]
["event6",null,null,null,{"$error":"#REF!"},{"$f":"IF(B12<>\"\",ROW(F11),\"\")","v":11},"event6",{"$f":"IF(B12<>\"\",B12,\"\")","v":"Products String Related*"},11,0,{"$f":"COUNTIF($B$6:$B$105, \"<=\"&$B12)","v":70},6,"","",56,6,"","",{"$f":"COUNTIF($B$211:$B$310, \"<=\"&$B215)","v":52},6,"",""]
["event7","Products String Related*",null,null,"",{"$f":"IF(B13<>\"\",ROW(F12),\"\")","v":""},"",{"$f":"IF(B13<>\"\",B13,\"\")","v":""},12,0,{"$f":"COUNTIF($B$6:$B$105, \"<=\"&$B13)","v":0},7,"","",26,7,"","",50,7,"",""]
["event8",null,null,null,{"$error":"#REF!"},{"$f":"IF(#REF!<>\"\",ROW(F13),\"\")","v":{"$error":"#REF!"}},{"$error":"#REF!"},{"$f":"IF(#REF!<>\"\",#REF!,\"\")","v":{"$error":"#REF!"}},13,0,{"$f":"COUNTIF($B$6:$B$105, \"<=\"&#REF!)","v":0},8,"","",0,8,"","",63,8,"",""]
["event9",null,null,null,"",{"$f":"IF(B14<>\"\",ROW(F14),\"\")","v":""},"",{"$f":"IF(B14<>\"\",B14,\"\")","v":""},14,0,{"$f":"COUNTIF($B$6:$B$105, \"<=\"&$B14)","v":0},9,"","",0,9,"","",0,9,"",""]
["event10",null,null,null,"","","","",15,0,0,10,"","",38,10,"","",0,10,"",""]
{"$rows_left_out":320}